{"text_format":"1","workbook":"xlsx","n_sheets":8,"sheets":["Policy","AP Status","Advising Projection Form","SAPRA","Quality Points Calculator","Sheet1","Grade Points","Sheet2"],"not_rendered":{"charts":0,"images":1,"macros":1,"external_links":0,"defined_names":4,"comments":1,"pivot_tables":0},"unopened":[],"bounds":{"document_bytes":16777216,"sheet_cells":100000,"rows_first":2000,"rows_last":500,"rows_between":2000,"halvings":0,"cell_chars":16384,"cell_head_chars":4096},"cells_cut":0,"cells_raw":0,"read":"whole","date_system":"1900"}

{"sheet":"Policy","index":0,"n_rows":22,"n_cols":9,"rows_kept":22,"cut":false,"hidden":true,"merged":[[0,1,0,10],[1,1,1,10],[13,1,13,3],[12,8,12,10],[13,8,13,10],[18,1,19,10],[21,1,21,10],[3,1,3,10],[8,8,8,10],[9,8,9,10],[9,1,9,3],[14,1,14,3],[14,8,14,10]]}
[null,"SATISFACTORY ACADEMIC PROGRESS POLICY"]
[null,"Effective January, 2012"]
[null,"POLICY"]
[null,"The Satisfactory Academic Progress Policy ensures that all students are maintaining satisfactory academic progress towards successful completion of their academic programs. The evaluation points and milestones contained in the policy are meant to identify problems for which actions of early intervention and/or remediation can be taken. Most critical to this policy is a student's ability to enroll in and complete courses in a consistent and successful manner. This ability is measured in three ways: cumulative grade point average (CGPA) and incremental completion rate (ICR) within a maximum timeframe (MTF). Failure to complete courses successfully for any reason may negatively affect satisfactory academic progress. Failing courses or withdrawing from courses could result in the loss of financial aid and academic termination. In order for a student to graduate, the minimum requirements are a CGPA of 2.0, an ICR of 66.67%, and completion of the program in no more than 150% of total program credits."]
[null,"MILESTONES AND EVALUATION POINTS"]
[null,"Evaluation Point",null,null,"Milestone (CGPA and ICR)",null,null,null,"Required Action"]
[null,"Certificate/Diploma"]
[null,"End of First Quarter",null,null,"< 1.0 CGPA and/or 33.33% ICR",null,null,null,"Academic/Financial Aid Warning"]
[null,"End of Second Quarter",null,null,"< 1.5 CGPA and/or 50.00% ICR",null,null,null,"Academic/Financial Aid Warning (if first time)\nAcademic/Financial Aid Dismissal (if on Warning)"]
[null,"End of Third Quarter and every quarter thereafter",null,null,"< 2.0 CGPA and/or 66.67% ICR",null,null,null,"Academic/Financial Aid Warning (if first time)\nAcademic/Financial Aid Dismissal (if on Warning)"]
[null,"Anything in excess of 150% MTF",null,null,null,null,null,null,"Dismissal"]
[null,"Degree"]
[null,"End of First Academic Year",null,null,"< 1.0 CGPA and/or 33.33% ICR",null,null,null,"Academic/Financial Aid Dismissal"]
[null,"End of Second Academic Year",null,null,"< 2.0 CGPA and/or 66.67% ICR",null,null,null,"Academic/Financial Aid Dismissal"]
[null,"End of Seventh Quarter and every Quarter thereafter",null,null,"< 2.0 CGPA and/or 66.67% ICR",null,null,null,"Academic/Financial Aid Warning (if first time)\nAcademic/Financial Aid Dismissal (if on Warning)"]
{"$rows_left_out":8}
{"sheet":"AP Status","index":1,"n_rows":27,"n_cols":33,"rows_kept":27,"cut":false,"hidden":true,"merged":[[0,1,0,5],[13,1,13,2],[13,4,13,5],[1,1,1,5],[7,4,7,5]]}
[null,"SAP CALCULATOR AND CURRENT AP STATUS"]
[null,"Enter student information into the white boxes below using transcript."]
[null,"Name",null,"Major"]
[null,null,null,null,"ID#"]
[null,"CURRENT SAP RESULTS",null,null,"Quarters Completed"]
[null,"ICR",{"$f":"IF(F5=0,\" \",IF(F16+C16-F17-F27=0,0,(C15-C17-C27)/(F16-F17-F27)))","v":" "},null,"Credits Left to Graduate",{"$f":"IF(F5=0,\" \",C12-(C15-C17-C27))","v":" "}]
[null,"CGPA",{"$f":"IF(F5=0,\" \",IF(C20=0,0,(F20-F26)/(C20)))","v":" "},null,"150% Creds Remaining",{"$f":"IF(F5=0,\" \",F15-(F16-F17-F27))","v":" "}]
[null,"SAP CGPA",{"$f":"IF(F5=0,\" \",IF(C20-C26=0,0,(F20-F26)/(C20-C26)))","v":" "},null,{"$f":"IF(F4=0,\" \",IF(F6>F7,\"150% Violation\",F7-F6 &\" Credit Window\"))","v":" "}]
[null,{"$f":"IF(F5=0,\" \",IF(C12>89,IF(C12>89,IF(AND(C6<0.3333,F5=3),VLOOKUP(F5,Table8[],3,FALSE),IF(AND(C6<0.3333,F5=3),VLOOKUP(F5,Table8[],3,FALSE),IF(AND(C6<0.6666,F5>5),VLOOKUP(F5,Table8[],3,FALSE),\" \"))),\" \"),IF('AP Status'!C12<89,IF('AP Status'!C12<89,IF(AND(C6<0.3333,F5<2),VLOOKUP(F5,Table6[],3,FALSE),IF(AND(F5<3,C6<0.5),VLOOKUP(F5,Table6[],3,FALSE),IF(AND(F5>2,C6<0.6666),VLOOKUP(F5,Table6[],3,FALSE),\" \"))),\" \"),\" \"))&\"   \"&IF(C12>89,IF(AND(C12>89,C8<1,F5=3),VLOOKUP(F5,Table9[],3,FALSE),IF(AND(C8<1,F5=3),VLOOKUP(F5,Table9[],3,FALSE),IF(AND(C8<1,F5=3),VLOOKUP(F5,Table9[],3,FALSE),IF(AND(C8<2,F5>5),VLOOKUP(F5,Table9[],3,FALSE),\" \")))),IF(C12<89,IF(AND(C12<89,C8<1,F5=1),VLOOKUP(F5,Table7[],3,FALSE),IF(AND(C8<1.5,F5=2),VLOOKUP(F5,Table7[],3,FALSE),IF(AND(C8<2,F5>2),VLOOKUP(F5,Table7[],3,FALSE),\" \"))),\" \")))","v":" "},null,null,null,null,null,null,null,null,null,null,null,null,null,null,null,null,null,null,null,null,null,null,null,null,null,null,null,null,null,{"$f":"SEARCH(\"ICR\",B9)","v":{"$error":"#VALUE!"}},{"$f":"SEARCH(\"CGPA\",B9)","v":{"$error":"#VALUE!"}}]
[]
[null,"FOR ICR AND MTF (Enter info from student transcript)"]
[null,"Program Length (Credits)"]
[]
[null,"Earned Credits",null,null,"Attempted Credits"]
[null,"Total Credits Earned",null,null,"Max Allowable",{"$f":"IF(F5=0,\" \",C12*1.5)","v":" "}]
{"$rows_left_out":13}
{"sheet":"Advising Projection Form","index":2,"n_rows":71,"n_cols":34,"rows_kept":71,"cut":false,"hidden":true,"merged":[[0,1,0,6],[1,1,1,6],[2,1,2,6],[7,5,7,6]]}
[null,"ADVISING PROJECTION FORM"]
[null,"Enter student information into the white boxes.",null,null,null,null,null,null,null,null,null,null,null,null,null,null,null,null,null,null,null,null,null,null,null,null,null,null,null,null,null,null,null,"Yes"]
[]
[null,{"$f":"'AP Status'!B4","v":0},null,{"$f":"'AP Status'!D4","v":0},null,{"$f":"'AP Status'!E4","v":"ID#"},{"$f":"'AP Status'!F4","v":0}]
[null,"PROJECTED SAP RESULTS",null,null,null,"Quarters Completed",{"$f":"'AP Status'!F5","v":0}]
[null,"ICR",{"$f":"'AP Status'!C6","v":" "},null,null,"Credits Left to Graduate",{"$f":"IF(G4=0,\" \",'AP Status'!F6-P18-P29-P40-P51-P62)","v":" "}]
[null,"CGPA",{"$f":"'AP Status'!C7","v":" "},null,null,"150% Creds Remaining",{"$f":"IF(G4=0,\" \",'AP Status'!F7-SUM(C12:C17)-SUM(C23:C28)-SUM(C34:C39)-SUM(C45:C50)-SUM(C56:C61))","v":" "}]
[null,"SAP CGPA",{"$f":"'AP Status'!C8","v":" "},null,null,{"$f":"IF(G4=0,\" \",IF(G6>G7,\"150% Violation\",IF(G6=0,\"Graduate\",G7-G6 &\" Credit Window\")))","v":" "}]
[]
[null,"NEXT QUARTER…",null,null,null,"Quarter",{"$f":"IF(G4=0,\" \",G5+1)","v":" "}]
[null,null,"Credits","Letter Grade","Failed Before?",null,null,null,"Points","ICR Earned","Qual Att",null,"Sess Qual Att",null,"MTF Att","MTF Earned"]
[null,"Course 1",null,null,null,"When taking less than 6 classes,",null,null,{"$f":"IF(D12=\"W\",0,IF(ISNA(VLOOKUP(D12,Table2[],2,FALSE)*C12),0,(VLOOKUP(D12,Table2[],2,FALSE)*C12)))","v":0},{"$f":"IF(D12=\"W\",0,IF(ISNA(IF(I12=0,0,C12)),\" \",(IF(I12=0,0,C12))))","v":0},{"$f":"IF(OR(D12=\"W\",E12=\"Yes\"),0,C12)","v":0},null,{"$f":"IF(D12=\"W\",0,IF(ISNA(IF(I12=0,0,C12)),\" \",(IF(I12=0,0,C12))))","v":0},null,{"$f":"IF(ISBLANK(C12),0,C12)","v":0},{"$f":"IF(C12=0,0,IF(AND(D12<>\"F\",D12<>\"W\"),C12,0))","v":0},null,null," "]
[null,"Course 2",null,null,null,"make sure there is no credit value",null,null,{"$f":"IF(D13=\"W\",0,IF(ISNA(VLOOKUP(D13,Table2[],2,FALSE)*C13),0,(VLOOKUP(D13,Table2[],2,FALSE)*C13)))","v":0},{"$f":"IF(D13=\"W\",0,IF(ISNA(IF(I13=0,0,C13)),\" \",(IF(I13=0,0,C13))))","v":0},{"$f":"IF(OR(D13=\"W\",E13=\"Yes\"),0,C13)","v":0},null,{"$f":"IF(D13=\"W\",0,IF(ISNA(IF(I13=0,0,C13)),\" \",(IF(I13=0,0,C13))))","v":0},null,{"$f":"IF(ISBLANK(C13),0,C13)","v":0},{"$f":"IF(C13=0,0,IF(AND(D13<>\"F\",D13<>\"W\"),C13,0))","v":0}]
[null,"Course 3",null,null,null,"or letter grade value entered.",null,null,{"$f":"IF(D14=\"W\",0,IF(ISNA(VLOOKUP(D14,Table2[],2,FALSE)*C14),0,(VLOOKUP(D14,Table2[],2,FALSE)*C14)))","v":0},{"$f":"IF(D14=\"W\",0,IF(ISNA(IF(I14=0,0,C14)),\" \",(IF(I14=0,0,C14))))","v":0},0,null,0,null,0,0]
[null,"Course 4",null,null,null,null,null,null,{"$f":"IF(D15=\"W\",0,IF(ISNA(VLOOKUP(D15,Table2[],2,FALSE)*C15),0,(VLOOKUP(D15,Table2[],2,FALSE)*C15)))","v":0},0,0,null,0,null,0,0]
{"$rows_left_out":57}
{"sheet":"SAPRA","index":3,"n_rows":57,"n_cols":41,"rows_kept":57,"cut":false,"hidden":true,"merged":[[0,1,0,11],[16,2,16,11],[17,2,17,11],[19,6,19,7],[1,1,1,11],[52,10,52,11],[55,10,55,11],[20,6,20,7],[11,6,12,7],[11,8,12,11],[44,1,44,6],[44,7,44,11],[21,6,21,7],[32,6,32,10],[34,6,34,10],[30,1,30,11],[38,1,38,11],[25,1,27,11]]}
[null,"SATISFACTORY ACADEMIC PROGRESS RESPONSIBILITY AGREEMENT (SAPRA)"]
[null,"Enter student information into the white boxes.",null,null,null,null,null,null,null,null,null,null,null,null,null,null,null,null,null,null,null,null,null,null,null,null,null,null,null,null,{"$f":"I4+1","v":1},null,"Dismissal",null,"a 1.0 CGPA and/or 33.33% ICR",null,null,null,"Yes","WI",2011]
[null,"Student Name",null,null,"Student ID","Major","Term","Year","Quarters Completed",null,null,null,null,null,null,null,null,null,null,null,null,null,null,null,null,null,null,null,null,null,{"$f":"I4+2","v":2},null,"Warning",null,"a 1.25 CGPA and/or 50% ICR",null,null,null,"No","SP",2012]
[null,{"$f":"'AP Status'!B4","v":0},null,null,{"$f":"'AP Status'!F4","v":0},{"$f":"'AP Status'!D4","v":0},"FA",2014,{"$f":"'AP Status'!F5","v":0},null,null,null,null,null,null,null,null,null,null,null,null,null,null,null,null,null,null,null,null,null,{"$f":"I4+3","v":3},null,"Probation",null,"a 1.50 CGPA and/or 50% ICR",null,null,null,"Not Applicable","SU",2013]
[null,null,null,null,null,null,null,null,null,null,null,null,null,null,null,null,null,null,null,null,null,null,null,null,null,null,null,null,null,null,null,null,null,null,"a 2.0 CGPA and/or 66.67% ICR",null,null,null,null,"FA",2014]
[null,"CURRENT ACADEMIC STANDING",null,null,null,null,null,null,null,null,null,null,null,null,null,null,null,null,null,null,null,null,null,null,null,null,null,null,null,null,null,null,null,null,"3x Remedial",null,null,null,null,null,2015]
[null,"As of Quarter:",{"$f":"I4","v":0},"CGPA:",{"$f":"'AP Status'!C8","v":" "},"ICR:",{"$f":"'AP Status'!C6","v":" "},null,null,null,null,null,null,null,null,null,null,null,null,null,null,null,null,null,null,null,null,null,null,null,null,null,null,null,"Maximum Allowable Timeframe (MTF)"]
[null,"ICR/CGPA Status:",{"$f":"'AP Status'!B9","v":" "}]
[null,"MTF Status:",{"$f":"'AP Status'!E8","v":" "}]
[]
[null,"ACADEMIC PROGRESS EVALUATION CRITERIA"]
[null,"Next evaluation point is at the end of quarter:",null,null,null,null,"Minimum standard to meet:"]
[null,"Inability to meet minimum standards will result in:",null,null,null,"Dismissal"]
[]
[]
{"$rows_left_out":43}
{"sheet":"Quality Points Calculator","index":4,"n_rows":49,"n_cols":17,"rows_kept":49,"cut":false,"hidden":false,"merged":[[9,8,9,9],[0,0,1,4],[21,11,21,12],[22,11,22,12]]}
["ICR/GPA CALCULATOR",null,null,null,null,null,"Student Name:"]
[null,null,null,null,null,null,"Student ID:"]
["SAP PROJECTION TOOL"]
["Grade","Course Credits","Grade Value","Grade Points","Credits",null,"Course Title",null,"Credits Attempted","Credits Earned","GPA","ICR","Grade Points"]
[null,null,{"$f":"IF(Table4[[#This Row],[Course Credits]]<1,\" \",VLOOKUP(Table4[[#This Row],[Grade]],Table2[#Data],2,FALSE))","v":" "},{"$f":"IF(Table4[[#This Row],[Course Credits]]<1,\" \",IF(ISNA(Table4[[#This Row],[Course Credits]]*Table4[[#This Row],[Grade Value]]),\"\",Table4[[#This Row],[Course Credits]]*Table4[[#This Row],[Grade Value]]))","v":" "},{"$f":"IF(Table4[[#This Row],[Grade Points]]<1, 0, Table4[[#This Row],[Course Credits]])","v":0},null,null,null,{"$f":"SUM(B5:B49)+SUM(I13:I25)+SUM(J13:J49)","v":0},{"$f":"SUM(E5:E49)+SUM(J13:J49)","v":0},{"$f":"SUM(D5:D49)/I7","v":{"$error":"#DIV/0!"}},{"$f":"J5/I5","v":{"$error":"#DIV/0!"}},{"$f":"SUM(D5:D100)","v":0}]
[null,null,{"$f":"IF(Table4[[#This Row],[Course Credits]]<1,\" \",VLOOKUP(Table4[[#This Row],[Grade]],Table2[#Data],2,FALSE))","v":" "},{"$f":"IF(Table4[[#This Row],[Course Credits]]<1,\" \",IF(ISNA(Table4[[#This Row],[Course Credits]]*Table4[[#This Row],[Grade Value]]),\"\",Table4[[#This Row],[Course Credits]]*Table4[[#This Row],[Grade Value]]))","v":" "},{"$f":"IF(Table4[[#This Row],[Grade Points]]<1, 0, Table4[[#This Row],[Course Credits]])","v":0},null,null,null,"Credits Attempted (GPA)"]
[null,null,{"$f":"IF(Table4[[#This Row],[Course Credits]]<1,\" \",VLOOKUP(Table4[[#This Row],[Grade]],Table2[#Data],2,FALSE))","v":" "},{"$f":"IF(Table4[[#This Row],[Course Credits]]<1,\" \",IF(ISNA(Table4[[#This Row],[Course Credits]]*Table4[[#This Row],[Grade Value]]),\"\",Table4[[#This Row],[Course Credits]]*Table4[[#This Row],[Grade Value]]))","v":" "},{"$f":"IF(Table4[[#This Row],[Grade Points]]<1, 0, Table4[[#This Row],[Course Credits]])","v":0},null,null,null,{"$f":"SUM(B5:B49)","v":0}]
[null,null,{"$f":"IF(Table4[[#This Row],[Course Credits]]<1,\" \",VLOOKUP(Table4[[#This Row],[Grade]],Table2[#Data],2,FALSE))","v":" "},{"$f":"IF(Table4[[#This Row],[Course Credits]]<1,\" \",IF(ISNA(Table4[[#This Row],[Course Credits]]*Table4[[#This Row],[Grade Value]]),\"\",Table4[[#This Row],[Course Credits]]*Table4[[#This Row],[Grade Value]]))","v":" "},{"$f":"IF(Table4[[#This Row],[Grade Points]]<1, 0, Table4[[#This Row],[Course Credits]])","v":0}]
[null,null,{"$f":"IF(Table4[[#This Row],[Course Credits]]<1,\" \",VLOOKUP(Table4[[#This Row],[Grade]],Table2[#Data],2,FALSE))","v":" "},{"$f":"IF(Table4[[#This Row],[Course Credits]]<1,\" \",IF(ISNA(Table4[[#This Row],[Course Credits]]*Table4[[#This Row],[Grade Value]]),\"\",Table4[[#This Row],[Course Credits]]*Table4[[#This Row],[Grade Value]]))","v":" "},{"$f":"IF(Table4[[#This Row],[Grade Points]]<1, 0, Table4[[#This Row],[Course Credits]])","v":0},null,null,null,null,null,null,"Credits ","Nursing GPA"]
[null,null,{"$f":"IF(Table4[[#This Row],[Course Credits]]<1,\" \",VLOOKUP(Table4[[#This Row],[Grade]],Table2[#Data],2,FALSE))","v":" "},{"$f":"IF(Table4[[#This Row],[Course Credits]]<1,\" \",IF(ISNA(Table4[[#This Row],[Course Credits]]*Table4[[#This Row],[Grade Value]]),\"\",Table4[[#This Row],[Course Credits]]*Table4[[#This Row],[Grade Value]]))","v":" "},{"$f":"IF(Table4[[#This Row],[Grade Points]]<1, 0, Table4[[#This Row],[Course Credits]])","v":0},null,null,null,"Credit Amounts Go Here ",null,null,{"$f":"SUM(M13:M21)","v":0},{"$f":"SUM(O13:O21)/L10","v":{"$error":"#DIV/0!"}}]
[null,null,{"$f":"IF(Table4[[#This Row],[Course Credits]]<1,\" \",VLOOKUP(Table4[[#This Row],[Grade]],Table2[#Data],2,FALSE))","v":" "},{"$f":"IF(Table4[[#This Row],[Course Credits]]<1,\" \",IF(ISNA(Table4[[#This Row],[Course Credits]]*Table4[[#This Row],[Grade Value]]),\"\",Table4[[#This Row],[Course Credits]]*Table4[[#This Row],[Grade Value]]))","v":" "},{"$f":"IF(Table4[[#This Row],[Grade Points]]<1, 0, Table4[[#This Row],[Course Credits]])","v":0}]
[null,null,{"$f":"IF(Table4[[#This Row],[Course Credits]]<1,\" \",VLOOKUP(Table4[[#This Row],[Grade]],Table2[#Data],2,FALSE))","v":" "},{"$f":"IF(Table4[[#This Row],[Course Credits]]<1,\" \",IF(ISNA(Table4[[#This Row],[Course Credits]]*Table4[[#This Row],[Grade Value]]),\"\",Table4[[#This Row],[Course Credits]]*Table4[[#This Row],[Grade Value]]))","v":" "},{"$f":"IF(Table4[[#This Row],[Grade Points]]<1, 0, Table4[[#This Row],[Course Credits]])","v":0},null,null,null,"Retake/Withdraw","Transfer",null,"Grade","Course Credits","Grade Value","Grade Points","Credits","Courses"]
[null,null,{"$f":"IF(Table4[[#This Row],[Course Credits]]<1,\" \",VLOOKUP(Table4[[#This Row],[Grade]],Table2[#Data],2,FALSE))","v":" "},{"$f":"IF(Table4[[#This Row],[Course Credits]]<1,\" \",IF(ISNA(Table4[[#This Row],[Course Credits]]*Table4[[#This Row],[Grade Value]]),\"\",Table4[[#This Row],[Course Credits]]*Table4[[#This Row],[Grade Value]]))","v":" "},{"$f":"IF(Table4[[#This Row],[Grade Points]]<1, 0, Table4[[#This Row],[Course Credits]])","v":0},null,null,null,null,null,null,null,null,{"$f":"IF(Table5[[#This Row],[Course Credits]]<1,\" \",VLOOKUP(Table5[[#This Row],[Grade]],Table2[#Data],2,FALSE))","v":" "},{"$f":"IF(Table5[[#This Row],[Course Credits]]<1,\" \",IF(ISNA(Table5[[#This Row],[Course Credits]]*Table5[[#This Row],[Grade Value]]),\"\",Table5[[#This Row],[Course Credits]]*Table5[[#This Row],[Grade Value]]))","v":" "},null,"WBIS"]
[null,null,{"$f":"IF(Table4[[#This Row],[Course Credits]]<1,\" \",VLOOKUP(Table4[[#This Row],[Grade]],Table2[#Data],2,FALSE))","v":" "},{"$f":"IF(Table4[[#This Row],[Course Credits]]<1,\" \",IF(ISNA(Table4[[#This Row],[Course Credits]]*Table4[[#This Row],[Grade Value]]),\"\",Table4[[#This Row],[Course Credits]]*Table4[[#This Row],[Grade Value]]))","v":" "},{"$f":"IF(Table4[[#This Row],[Grade Points]]<1, 0, Table4[[#This Row],[Course Credits]])","v":0},null,null,null,null,null,null,null,null,{"$f":"IF(Table5[[#This Row],[Course Credits]]<1,\" \",VLOOKUP(Table5[[#This Row],[Grade]],Table2[#Data],2,FALSE))","v":" "},{"$f":"IF(Table5[[#This Row],[Course Credits]]<1,\" \",IF(ISNA(Table5[[#This Row],[Course Credits]]*Table5[[#This Row],[Grade Value]]),\"\",Table5[[#This Row],[Course Credits]]*Table5[[#This Row],[Grade Value]]))","v":" "},null,"PSYCH"]
[null,null,{"$f":"IF(Table4[[#This Row],[Course Credits]]<1,\" \",VLOOKUP(Table4[[#This Row],[Grade]],Table2[#Data],2,FALSE))","v":" "},{"$f":"IF(Table4[[#This Row],[Course Credits]]<1,\" \",IF(ISNA(Table4[[#This Row],[Course Credits]]*Table4[[#This Row],[Grade Value]]),\"\",Table4[[#This Row],[Course Credits]]*Table4[[#This Row],[Grade Value]]))","v":" "},{"$f":"IF(Table4[[#This Row],[Grade Points]]<1, 0, Table4[[#This Row],[Course Credits]])","v":0},null,null,null,null,null,null,null,null,{"$f":"IF(Table5[[#This Row],[Course Credits]]<1,\" \",VLOOKUP(Table5[[#This Row],[Grade]],Table2[#Data],2,FALSE))","v":" "},{"$f":"IF(Table5[[#This Row],[Course Credits]]<1,\" \",IF(ISNA(Table5[[#This Row],[Course Credits]]*Table5[[#This Row],[Grade Value]]),\"\",Table5[[#This Row],[Course Credits]]*Table5[[#This Row],[Grade Value]]))","v":" "},null,"NURS 200"]
{"$rows_left_out":35}
{"sheet":"Sheet1","index":5,"n_rows":38,"n_cols":15,"rows_kept":38,"cut":false,"hidden":true,"merged":[]}
["Diploma ICR",null,null,null,"Diploma CGPA",null,null,null,"Degree ICR",null,null,null,"Degree CGPA"]
["Quarter","Action","Reason",null,"Quarter","Action","Reason",null,"Quarter","Action","Reason",null,"Quarter","Action","Reason"]
[1,"Academic Warning","ICR less than 33.33% after 1st Quarter",null,1,"Academic Warning","CGPA less than 1.0 after 1st Quarter",null,1,"Academic Warning"," ",null,1,"Academic Warning"," "]
[2,"Academic Warning","ICR less than 50% after 2nd Quarter",null,2,"Academic Warning","CGPA less than 1.5 after 2nd Quarter",null,2,"Academic Warning"," ",null,2,"Academic Warning"," "]
[3,"Academic Warning","ICR less than 66.67% after 3rd Quarter",null,3,"Academic Warning","CGPA less than 2.0 after 3rd Quarter",null,3,"Academic Warning","ICR less than 33.33% after 3rd Quarter",null,3,"Academic Warning","CGPA less than 1.0 after 3rd Quarter"]
[4,"Academic Warning","ICR less than 66.67% after 3rd Quarter",null,4,"Academic Warning","CGPA less than 2.0 after 3rd Quarter",null,4,"Academic Warning"," ",null,4,"Academic Warning"," "]
[5,"Academic Warning","ICR less than 66.67% after 3rd Quarter",null,5,"Academic Warning","CGPA less than 2.0 after 3rd Quarter",null,5,"Academic Warning"," ",null,5,"Academic Warning"," "]
[6,"Academic Warning","ICR less than 66.67% after 3rd Quarter",null,6,"Academic Warning","CGPA less than 2.0 after 3rd Quarter",null,6,"Academic Warning","ICR less than 66.67% after 6th Quarter",null,6,"Academic Warning","CGPA less than 2.0 after 6th Quarter"]
[7,"Academic Warning","ICR less than 66.67% after 3rd Quarter",null,7,"Academic Warning","CGPA less than 2.0 after 3rd Quarter",null,7,"Academic Warning","ICR less than 66.67% after 6th Quarter",null,7,"Academic Warning","CGPA less than 2.0 after 6th Quarter"]
[8,"Academic Warning","ICR less than 66.67% after 3rd Quarter",null,8,"Academic Warning","CGPA less than 2.0 after 3rd Quarter",null,8,"Academic Warning","ICR less than 66.67% after 6th Quarter",null,8,"Academic Warning","CGPA less than 2.0 after 6th Quarter"]
[9,"Academic Warning","ICR less than 66.67% after 3rd Quarter",null,9,"Academic Warning","CGPA less than 2.0 after 3rd Quarter",null,9,"Academic Warning","ICR less than 66.67% after 6th Quarter",null,9,"Academic Warning","CGPA less than 2.0 after 6th Quarter"]
[10,"Academic Warning","ICR less than 66.67% after 3rd Quarter",null,10,"Academic Warning","CGPA less than 2.0 after 3rd Quarter",null,10,"Academic Warning","ICR less than 66.67% after 6th Quarter",null,10,"Academic Warning","CGPA less than 2.0 after 6th Quarter"]
[11,"Academic Warning","ICR less than 66.67% after 3rd Quarter",null,11,"Academic Warning","CGPA less than 2.0 after 3rd Quarter",null,11,"Academic Warning","ICR less than 66.67% after 6th Quarter",null,11,"Academic Warning","CGPA less than 2.0 after 6th Quarter"]
[12,"Academic Warning","ICR less than 66.67% after 3rd Quarter",null,12,"Academic Warning","CGPA less than 2.0 after 3rd Quarter",null,12,"Academic Warning","ICR less than 66.67% after 6th Quarter",null,12,"Academic Warning","CGPA less than 2.0 after 6th Quarter"]
[13,"Academic Warning","ICR less than 66.67% after 3rd Quarter",null,13,"Academic Warning","CGPA less than 2.0 after 3rd Quarter",null,13,"Academic Warning","ICR less than 66.67% after 6th Quarter",null,13,"Academic Warning","CGPA less than 2.0 after 6th Quarter"]
{"$rows_left_out":24}
{"sheet":"Grade Points","index":6,"n_rows":16,"n_cols":2,"rows_kept":16,"cut":false,"hidden":true,"merged":[]}
["Grade","Point Value"]
["A",4]
["A-",3.67]
["B+",3.33]
["B",3]
["B-",2.67]
["C+",2.33]
["C",2]
["C-",1.67]
["D+",1.33]
["D",1]
["D-",0.67]
["F",0]
["AB",3.5]
["BC",2.5]
{"$rows_left_out":2}
{"sheet":"Sheet2","index":7,"n_rows":0,"n_cols":0,"rows_kept":0,"cut":false,"hidden":true,"merged":[]}